SupportCategory: Simple Object DesignerDeployment Failure
David Fairbanks asked 4 weeks ago

Hi - I\'m getting this error when publishing to test env:
Deployment failed. Errors: App ID : ec286bfd-4d5b-4681-97de-2d2868ef2fdd Message : { Extension compilation failed
PageExtensions/Job_Card_PageExt.al(5,10): error AL0104: Syntax error, \'}\' expected
PageExtensions/Job_Card_PageExt.al(5,10): error AL0104: Syntax error, \'}\' expected
PageExtensions/Job_Card_PageExt.al(5,10): error AL0198: Expected one of the application object keywords (table, tableextension, page, pageextension, pagecustomization, profile, codeunit, report, reportextension, xmlport, query, controladdin, dotnet, enum, enumextension, interface, permissionset, permissionsetextension, entitlement) }
I\'ve recently updated and refreshed.  Is there something else I can do to get this deployed?

Attachments
hougaard Staff replied 4 weeks ago

Hi Dave,
Can you add an attachment with the .app file so I can see the generated code?

David Fairbanks replied 4 weeks ago

Hi – thanks for having a look. See the .app file attached.

hougaard Staff replied 4 weeks ago

I only see the deploymentfaiture.zip with a word doc in to… Otherwise, send the .app file to support@hougaard.com, thanks!

David Fairbanks replied 4 weeks ago

Will do!

David Fairbanks replied 4 weeks ago

Well my email server is not letting me send the ZIP file. I’ll try again to attach to the original ticket.

David Fairbanks replied 4 weeks ago

The ZIP of the APP file is attached…thanks for having a look!

1 Answers
hougaard Staff answered 4 weeks ago
Ahh.. I see it now, click "Pages" under inspect, and find page 88 Job Card... Click "New Sections", there you have created a rather incomplete section called "189", delete that and try again :) (I'll add a check for that in the next version).    
David Fairbanks replied 4 weeks ago

Yeppers! That was it. Thanks for finding that. All good and deployed. Appreciate the help.